Reaction Details
TargetHistamine H1 receptor
LigandBDBM50402813
Substrate/Competitorn/a
Meas. Tech.ChEMBL_887254 (CHEMBL2215810)
Ki 7.94±n/a nM
Citation Furber, MAlcaraz, LLuckhurst, CBahl, ABeaton, HBowers, KCollington, JDenton, RDonald, DKinchin, EMacDonald, CRigby, ARiley, RSoars, MSpringthorpe, BWebborn, P Discovery and evolution of phenoxypiperidine hydroxyamide dual CCR3/H1 antagonists. Part I. Bioorg Med Chem Lett22:7702-6 (2012) 
 
Histamine H1 receptor
Name:Histamine H1 receptor
Type:G Protein-Coupled Receptor (GPCR)
Mol. Mass.:55808.72
Organism:Homo sapiens (Human)
Description:Cell pellets from SK-N-MC cells transfected with human H1 receptor were used in binding assay.
Residue:487
BDBM50402813
NameBDBM50402813
Synonyms:CHEMBL2208429
TypeSmall organic molecule
Emp. Form.C22H24Cl2N4O3
Mol. Mass.463.357
SMILESO[C@H](CNC(=O)c1n[nH]c2ccccc12)CN1CCC(CC1)Oc1ccc(Cl)c(Cl)c1