Reaction Details
TargetC-C chemokine receptor type 3
LigandBDBM50402816
Substrate/Competitorn/a
Meas. Tech.ChEMBL_887257 (CHEMBL2215813)
Ki 1.58±n/a nM
Citation Furber, MAlcaraz, LLuckhurst, CBahl, ABeaton, HBowers, KCollington, JDenton, RDonald, DKinchin, EMacDonald, CRigby, ARiley, RSoars, MSpringthorpe, BWebborn, P Discovery and evolution of phenoxypiperidine hydroxyamide dual CCR3/H1 antagonists. Part I. Bioorg Med Chem Lett22:7702-6 (2012) 
 
C-C chemokine receptor type 3
Name:C-C chemokine receptor type 3
Type:Enzyme
Mol. Mass.:41053.88
Organism:Homo sapiens (Human)
Description:P51677
Residue:355
BDBM50402816
NameBDBM50402816
Synonyms:CHEMBL2208431
TypeSmall organic molecule
Emp. Form.C23H24Cl2N4O4
Mol. Mass.491.367
SMILESO[C@H](CNC(=O)c1n[nH]c(=O)c2ccccc12)CN1CCC(CC1)Oc1ccc(Cl)c(Cl)c1