Reaction Details
TargetSerine/threonine-protein kinase 17A
LigandBDBM50392982
Substrate/Competitorn/a
Meas. Tech.ChEMBL_884745 (CHEMBL2215626)
Kd>10000±n/a nM
Citation Gong, LTan, YCBoice, GAbbot, SMcCaleb, KIyer, PZuo, FDal Porto, JWong, BJin, SChang, ATran, PHsieh, GNiu, LShao, AReuter, DLukacs, CMUrsula Kammlott, RKuglstatter, AGoldstein, D Discovery of a novel series of 4-quinolone JNK inhibitors. Bioorg Med Chem Lett22:7381-7 (2012) 
 
Serine/threonine-protein kinase 17A
Name:Serine/threonine-protein kinase 17A
Type:Enzyme Catalytic Domain
Mol. Mass.:46544.04
Organism:Homo sapiens (Human)
Description:gi_109255245
Residue:414
BDBM50392982
NameBDBM50392982
Synonyms:CHEMBL2152382
TypeSmall organic molecule
Emp. Form.C27H23ClN2O5
Mol. Mass.490.935
SMILESCOC(=O)c1c(Cc2ccc(cc2)C(=O)NCCO)c(=O)c2ccc(Cl)cc2n1-c1ccccc1