Reaction Details
TargetMitogen-activated protein kinase 9
LigandBDBM50402830
Substrate/Competitorn/a
Meas. Tech.ChEMBL_884763 (CHEMBL2215644)
IC50 220±n/a nM
Citation Gong, LTan, YCBoice, GAbbot, SMcCaleb, KIyer, PZuo, FDal Porto, JWong, BJin, SChang, ATran, PHsieh, GNiu, LShao, AReuter, DLukacs, CMUrsula Kammlott, RKuglstatter, AGoldstein, D Discovery of a novel series of 4-quinolone JNK inhibitors. Bioorg Med Chem Lett22:7381-7 (2012) 
 
Mitogen-activated protein kinase 9
Name:Mitogen-activated protein kinase 9
Type:Enzyme
Mol. Mass.:48131.49
Organism:Homo sapiens (Human)
Description:JNK-2 was purchased from Upstate Cell Signaling Solutions (formerly Upstate Biotechnology).
Residue:424
BDBM50402830
NameBDBM50402830
Synonyms:CHEMBL2204093
TypeSmall organic molecule
Emp. Form.C25H19F3N2O5S
Mol. Mass.516.489
SMILESCOC(=O)c1c(Cc2ccc(cc2)S(C)(=O)=O)c(=O)c2ccc(nc2n1-c1ccccc1)C(F)(F)F