Reaction Details
TargetMitogen-activated protein kinase 9
LigandBDBM50402843
Substrate/Competitorn/a
Meas. Tech.ChEMBL_884763 (CHEMBL2215644)
IC50 28±n/a nM
Citation Gong, LTan, YCBoice, GAbbot, SMcCaleb, KIyer, PZuo, FDal Porto, JWong, BJin, SChang, ATran, PHsieh, GNiu, LShao, AReuter, DLukacs, CMUrsula Kammlott, RKuglstatter, AGoldstein, D Discovery of a novel series of 4-quinolone JNK inhibitors. Bioorg Med Chem Lett22:7381-7 (2012) 
 
Mitogen-activated protein kinase 9
Name:Mitogen-activated protein kinase 9
Type:Enzyme
Mol. Mass.:48131.49
Organism:Homo sapiens (Human)
Description:JNK-2 was purchased from Upstate Cell Signaling Solutions (formerly Upstate Biotechnology).
Residue:424
BDBM50402843
NameBDBM50402843
Synonyms:CHEMBL2204113
TypeSmall organic molecule
Emp. Form.C28H28N4O5S
Mol. Mass.532.611
SMILESCOC(=O)c1c(Cc2ccc(cc2)S(=O)(=O)N2CCNCC2)c(=O)c2ccc(C)nc2n1-c1ccccc1