Reaction Details
TargetMitogen-activated protein kinase 9
LigandBDBM50373215
Substrate/Competitorn/a
Meas. Tech.ChEMBL_884763 (CHEMBL2215644)
IC50 72±n/a nM
Citation Gong, LTan, YCBoice, GAbbot, SMcCaleb, KIyer, PZuo, FDal Porto, JWong, BJin, SChang, ATran, PHsieh, GNiu, LShao, AReuter, DLukacs, CMUrsula Kammlott, RKuglstatter, AGoldstein, D Discovery of a novel series of 4-quinolone JNK inhibitors. Bioorg Med Chem Lett22:7381-7 (2012) 
 
Mitogen-activated protein kinase 9
Name:Mitogen-activated protein kinase 9
Type:Enzyme
Mol. Mass.:48131.49
Organism:Homo sapiens (Human)
Description:JNK-2 was purchased from Upstate Cell Signaling Solutions (formerly Upstate Biotechnology).
Residue:424
BDBM50373215
NameBDBM50373215
Synonyms:CHEMBL259060
TypeSmall organic molecule
Emp. Form.C25H20BrNO5S
Mol. Mass.526.399
SMILESCOC(=O)c1c(-c2ccccc2)c2cc(Br)ccc2c(=O)n1Cc1ccc(cc1)S(C)(=O)=O