Reaction Details
TargetMyosin light chain kinase family member 4
LigandBDBM50392982
Substrate/Competitorn/a
Meas. Tech.ChEMBL_884737 (CHEMBL2215618)
Kd>10000±n/a nM
Citation Gong, LTan, YCBoice, GAbbot, SMcCaleb, KIyer, PZuo, FDal Porto, JWong, BJin, SChang, ATran, PHsieh, GNiu, LShao, AReuter, DLukacs, CMUrsula Kammlott, RKuglstatter, AGoldstein, D Discovery of a novel series of 4-quinolone JNK inhibitors. Bioorg Med Chem Lett22:7381-7 (2012) 
 
Myosin light chain kinase family member 4
Name:Myosin light chain kinase family member 4
Type:PROTEIN
Mol. Mass.:44505.40
Organism:Homo sapiens (Human)
Description:ChEMBL_774289
Residue:388
BDBM50392982
NameBDBM50392982
Synonyms:CHEMBL2152382
TypeSmall organic molecule
Emp. Form.C27H23ClN2O5
Mol. Mass.490.935
SMILESCOC(=O)c1c(Cc2ccc(cc2)C(=O)NCCO)c(=O)c2ccc(Cl)cc2n1-c1ccccc1