Reaction Details
TargetProstaglandin E synthase
LigandBDBM50029593
Substrate/Competitorn/a
Meas. Tech.ChEMBL_885120 (CHEMBL2212754)
IC50 20000±n/a nM
Citation Park, SJHan, SGAhsan, HMLee, KLee, JYShin, JSLee, KTKang, NSYu, YG Identification of novel mPGES-1 inhibitors through screening of a chemical library. Bioorg Med Chem Lett22:7335-9 (2012) 
 
Prostaglandin E synthase
Name:Prostaglandin E synthase
Type:Protein
Mol. Mass.:17112.22
Organism:Homo sapiens (Human)
Description:n/a
Residue:152
BDBM50029593
NameBDBM50029593
Synonyms:CHEMBL7162 N-(2-Cyclohexyloxy-4-nitro-phenyl)-methanesulfonamide N-[2-(cyclohexyloxy)-4-nitrophenyl]methane sulfonamide N-{2-(cyclohexyloxy)-4-[hydroxy(oxido)amino]phenyl}methanesulfonamide NS398
TypeSmall organic molecule
Emp. Form.C13H18N2O5S
Mol. Mass.314.357
SMILESCS(=O)(=O)Nc1ccc(cc1OC1CCCCC1)[N+]([O-])=O