Reaction Details
TargetCannabinoid receptor 1
LigandBDBM50402862
Substrate/Competitorn/a
Meas. Tech.ChEMBL_885143 (CHEMBL2213234)
Ki>30000±n/a nM
Citation Thur, YBhalerao, AMunshi, ZPansare, NMann, KHanauer, GKley, HPNappe, SWeiss-Haljiti, COstermann, CZitt, CSchaefer, MMondal, DAli Siddiki, AArmugam, VGudaghe, VGupta, MRayudu, PDautzenberg, FMDas Sarma, K Structure-activity relationships of 2-arylamido-5,7-dihydro-4H-thieno[2,3-c]pyran-3-carboxamide derivatives as cannabinoid receptor agonists and their analgesic action. Bioorg Med Chem Lett22:7314-21 (2012) 
 
Cannabinoid receptor 1
Name:Cannabinoid receptor 1
Type:G Protein-Coupled Receptor (GPCR)
Mol. Mass.:52856.55
Organism:Rattus norvegicus (rat)
Description:P20272
Residue:473
BDBM50402862
NameBDBM50402862
Synonyms:CHEMBL2205620
TypeSmall organic molecule
Emp. Form.C19H19F3N2O4S
Mol. Mass.428.425
SMILESCOCCNC(=O)c1c(NC(=O)c2ccccc2C(F)(F)F)sc2COCCc12