Reaction Details
TargetCannabinoid receptor 2
LigandBDBM50402859
Substrate/Competitorn/a
Meas. Tech.ChEMBL_885145 (CHEMBL2213236)
Ki 594±n/a nM
Citation Thur, YBhalerao, AMunshi, ZPansare, NMann, KHanauer, GKley, HPNappe, SWeiss-Haljiti, COstermann, CZitt, CSchaefer, MMondal, DAli Siddiki, AArmugam, VGudaghe, VGupta, MRayudu, PDautzenberg, FMDas Sarma, K Structure-activity relationships of 2-arylamido-5,7-dihydro-4H-thieno[2,3-c]pyran-3-carboxamide derivatives as cannabinoid receptor agonists and their analgesic action. Bioorg Med Chem Lett22:7314-21 (2012) 
 
Cannabinoid receptor 2
Name:Cannabinoid receptor 2
Type:Enzyme
Mol. Mass.:39366.68
Organism:Rattus norvegicus (Rat)
Description:Q9QZN9
Residue:360
BDBM50402859
NameBDBM50402859
Synonyms:CHEMBL2205591
TypeSmall organic molecule
Emp. Form.C19H15F5N2O3S
Mol. Mass.446.391
SMILESFC(F)(F)c1ccccc1C(=O)Nc1sc2COCCc2c1C(=O)N1CC(F)(F)C1