Reaction Details
TargetCannabinoid receptor 2
LigandBDBM50402873
Substrate/Competitorn/a
Meas. Tech.ChEMBL_885141 (CHEMBL2213232)
EC50 35±n/a nM
Citation Thur, YBhalerao, AMunshi, ZPansare, NMann, KHanauer, GKley, HPNappe, SWeiss-Haljiti, COstermann, CZitt, CSchaefer, MMondal, DAli Siddiki, AArmugam, VGudaghe, VGupta, MRayudu, PDautzenberg, FMDas Sarma, K Structure-activity relationships of 2-arylamido-5,7-dihydro-4H-thieno[2,3-c]pyran-3-carboxamide derivatives as cannabinoid receptor agonists and their analgesic action. Bioorg Med Chem Lett22:7314-21 (2012) 
 
Cannabinoid receptor 2
Name:Cannabinoid receptor 2
Type:G Protein-Coupled Receptor (GPCR)
Mol. Mass.:39690.94
Organism:Homo sapiens (Human)
Description:P34972
Residue:360
BDBM50402873
NameBDBM50402873
Synonyms:CHEMBL2205618
TypeSmall organic molecule
Emp. Form.C20H19F3N2O4S
Mol. Mass.440.436
SMILESFC(F)(F)Oc1ccccc1C(=O)Nc1sc2COCCc2c1C(=O)NCC1CC1