Reaction Details
TargetCannabinoid receptor 1
LigandBDBM50402911
Substrate/Competitorn/a
Meas. Tech.ChEMBL_885135 (CHEMBL2212769)
EC50 3972±n/a nM
Citation Thur, YBhalerao, AMunshi, ZPansare, NMann, KHanauer, GKley, HPNappe, SWeiss-Haljiti, COstermann, CZitt, CSchaefer, MMondal, DAli Siddiki, AArmugam, VGudaghe, VGupta, MRayudu, PDautzenberg, FMDas Sarma, K Structure-activity relationships of 2-arylamido-5,7-dihydro-4H-thieno[2,3-c]pyran-3-carboxamide derivatives as cannabinoid receptor agonists and their analgesic action. Bioorg Med Chem Lett22:7314-21 (2012) 
 
Cannabinoid receptor 1
Name:Cannabinoid receptor 1
Type:G Protein-Coupled Receptor (GPCR)
Mol. Mass.:52868.96
Organism:Homo sapiens (Human)
Description:P21554
Residue:472
BDBM50402911
NameBDBM50402911
Synonyms:CHEMBL2204900
TypeSmall organic molecule
Emp. Form.C19H28N2O3S
Mol. Mass.364.502
SMILESCOC1CN(C1)C(=O)c1c(NC(=O)CC(C)(C)C)sc2CCCCc12