Reaction Details
TargetMitogen-activated protein kinase kinase kinase 5
LigandBDBM50334268
Substrate/Competitorn/a
Meas. Tech.ChEMBL_885288 (CHEMBL2214716)
IC50 14±n/a nM
Citation Terao, YSuzuki, HYoshikawa, MYashiro, HTakekawa, SFujitani, YOkada, KInoue, YYamamoto, YNakagawa, HYao, SKawamoto, TUchikawa, O Design and biological evaluation of imidazo[1,2-a]pyridines as novel and potent ASK1 inhibitors. Bioorg Med Chem Lett22:7326-9 (2012) 
 
Mitogen-activated protein kinase kinase kinase 5
Name:Mitogen-activated protein kinase kinase kinase 5
Type:Protein
Mol. Mass.:154514.93
Organism:Homo sapiens (Human)
Description:Q99683
Residue:1374
BDBM50334268
NameBDBM50334268
Synonyms:CHEMBL1642655 N-(6-(1H-imidazol-1-yl)imidazo[1,2-a]pyridin-2-yl)-4-tert-butylbenzamide
TypeSmall organic molecule
Emp. Form.C21H21N5O
Mol. Mass.359.4243
SMILESCC(C)(C)c1ccc(cc1)C(=O)Nc1cn2cc(ccc2n1)-n1ccnc1