Reaction Details
TargetAlpha-mannosidase 2
LigandBDBM50402967
Substrate/Competitorn/a
Meas. Tech.ChEMBL_885340 (CHEMBL2215203)
Ki 15480±n/a nM
Citation Moorthy, NSBrás, NFRamos, MJFernandes, PA Virtual screening and QSAR study of some pyrrolidine derivatives asa-mannosidase inhibitors for binding feature analysis. Bioorg Med Chem20:6945-59 (2012) 
 
Alpha-mannosidase 2
Name:Alpha-mannosidase 2
Type:Protein
Mol. Mass.:131156.65
Organism:Homo sapiens (Human)
Description:Q16706
Residue:1144
BDBM50402967
NameBDBM50402967
Synonyms:CHEMBL2206823
TypeSmall organic molecule
Emp. Form.C20H25BrN2O4
Mol. Mass.437.328
SMILESO[C@H]1CN[C@H](CN[C@@H](COCOc2ccc(Br)cc2)c2ccccc2)[C@H]1O