Reaction Details
TargetAlpha-mannosidase 2
LigandBDBM50402971
Substrate/Competitorn/a
Meas. Tech.ChEMBL_885340 (CHEMBL2215203)
Ki 9140±n/a nM
Citation Moorthy, NSBrás, NFRamos, MJFernandes, PA Virtual screening and QSAR study of some pyrrolidine derivatives asa-mannosidase inhibitors for binding feature analysis. Bioorg Med Chem20:6945-59 (2012) 
 
Alpha-mannosidase 2
Name:Alpha-mannosidase 2
Type:Protein
Mol. Mass.:131156.65
Organism:Homo sapiens (Human)
Description:Q16706
Residue:1144
BDBM50402971
NameBDBM50402971
Synonyms:CHEMBL2206819
TypeSmall organic molecule
Emp. Form.C20H25FN2O3
Mol. Mass.360.4225
SMILESO[C@H]1CN[C@H](CN[C@@H](COCc2cccc(F)c2)c2ccccc2)[C@H]1O