Reaction Details
TargetAlpha-mannosidase 2
LigandBDBM50402974
Substrate/Competitorn/a
Meas. Tech.ChEMBL_885340 (CHEMBL2215203)
Ki 11800±n/a nM
Citation Moorthy, NSBrás, NFRamos, MJFernandes, PA Virtual screening and QSAR study of some pyrrolidine derivatives asa-mannosidase inhibitors for binding feature analysis. Bioorg Med Chem20:6945-59 (2012) 
 
Alpha-mannosidase 2
Name:Alpha-mannosidase 2
Type:Protein
Mol. Mass.:131156.65
Organism:Homo sapiens (Human)
Description:Q16706
Residue:1144
BDBM50402974
NameBDBM50402974
Synonyms:CHEMBL2206816
TypeSmall organic molecule
Emp. Form.C14H22N2O4
Mol. Mass.282.3355
SMILESOC[C@H](NC[C@H]1N[C@H](CO)[C@H](O)[C@@H]1O)c1ccccc1