Reaction Details
TargetAlpha-mannosidase 2
LigandBDBM50169001
Substrate/Competitorn/a
Meas. Tech.ChEMBL_885340 (CHEMBL2215203)
Ki 29880±n/a nM
Citation Moorthy, NSBrás, NFRamos, MJFernandes, PA Virtual screening and QSAR study of some pyrrolidine derivatives asa-mannosidase inhibitors for binding feature analysis. Bioorg Med Chem20:6945-59 (2012) 
 
Alpha-mannosidase 2
Name:Alpha-mannosidase 2
Type:Protein
Mol. Mass.:131156.65
Organism:Homo sapiens (Human)
Description:Q16706
Residue:1144
BDBM50169001
NameBDBM50169001
Synonyms:(2R,3R,4S)-2-({[(1S)-2-HYDROXY-1-PHENYLETHYL]AMINO}METHYL)PYRROLIDINE-3,4-DIOL | CHEMBL189366
TypeSmall organic molecule
Emp. Form.C13H20N2O3
Mol. Mass.252.3095
SMILESOC[C@@H](NC[C@H]1NC[C@H](O)[C@@H]1O)c1ccccc1