Reaction Details
TargetProtein-tyrosine kinase 2-beta
LigandBDBM50402995
Substrate/Competitorn/a
Meas. Tech.ChEMBL_885500 (CHEMBL2209552)
IC50 1350±n/a nM
Citation Bhattacharya, SKAspnes, GEBagley, SWBoehm, MBrosius, ADBuckbinder, LChang, JSDibrino, JEng, HFrederick, KSGriffith, DAGriffor, MCGuimarães, CRGuzman-Perez, AHan, SKalgutkar, ASKlug-McLeod, JGarcia-Irizarry, CLi, JLippa, BPrice, DASouthers, JAWalker, DPWei, LXiao, JZawistoski, MPZhao, X Identification of novel series of pyrazole and indole-urea based DFG-out PYK2 inhibitors. Bioorg Med Chem Lett22:7523-9 (2012) 
 
Protein-tyrosine kinase 2-beta
Name:Protein-tyrosine kinase 2-beta
Type:Protein
Mol. Mass.:115868.80
Organism:Homo sapiens (Human)
Description:Q14289
Residue:1009
BDBM50402995
NameBDBM50402995
Synonyms:CHEMBL2207436
TypeSmall organic molecule
Emp. Form.C22H24N8O2
Mol. Mass.432.4784
SMILESCc1ccc(cc1)-n1nc(cc1NC(=O)Nc1cc(n[nH]1)-c1ccc(=O)[nH]n1)C(C)(C)C