Reaction Details
TargetProtein-tyrosine kinase 2-beta
LigandBDBM50402993
Substrate/Competitorn/a
Meas. Tech.ChEMBL_885497 (CHEMBL2209549)
IC50 607±n/a nM
Citation Bhattacharya, SKAspnes, GEBagley, SWBoehm, MBrosius, ADBuckbinder, LChang, JSDibrino, JEng, HFrederick, KSGriffith, DAGriffor, MCGuimarães, CRGuzman-Perez, AHan, SKalgutkar, ASKlug-McLeod, JGarcia-Irizarry, CLi, JLippa, BPrice, DASouthers, JAWalker, DPWei, LXiao, JZawistoski, MPZhao, X Identification of novel series of pyrazole and indole-urea based DFG-out PYK2 inhibitors. Bioorg Med Chem Lett22:7523-9 (2012) 
 
Protein-tyrosine kinase 2-beta
Name:Protein-tyrosine kinase 2-beta
Type:PROTEIN
Mol. Mass.:115790.07
Organism:Mus musculus
Description:ChEMBL_885497
Residue:1009
BDBM50402993
NameBDBM50402993
Synonyms:CHEMBL2207432
TypeSmall organic molecule
Emp. Form.C24H27N7O2
Mol. Mass.445.5169
SMILESCOc1ccc(nc1)-c1cc(NC(=O)Nc2cc(nn2-c2ccc(C)cc2)C(C)(C)C)[nH]n1