Reaction Details
TargetProtein-tyrosine kinase 2-beta
LigandBDBM50402997
Substrate/Competitorn/a
Meas. Tech.ChEMBL_885497 (CHEMBL2209549)
IC50 553±n/a nM
Citation Bhattacharya, SKAspnes, GEBagley, SWBoehm, MBrosius, ADBuckbinder, LChang, JSDibrino, JEng, HFrederick, KSGriffith, DAGriffor, MCGuimarães, CRGuzman-Perez, AHan, SKalgutkar, ASKlug-McLeod, JGarcia-Irizarry, CLi, JLippa, BPrice, DASouthers, JAWalker, DPWei, LXiao, JZawistoski, MPZhao, X Identification of novel series of pyrazole and indole-urea based DFG-out PYK2 inhibitors. Bioorg Med Chem Lett22:7523-9 (2012) 
 
Protein-tyrosine kinase 2-beta
Name:Protein-tyrosine kinase 2-beta
Type:PROTEIN
Mol. Mass.:115790.07
Organism:Mus musculus
Description:ChEMBL_885497
Residue:1009
BDBM50402997
NameBDBM50402997
Synonyms:CHEMBL2207429
TypeSmall organic molecule
Emp. Form.C32H35N7O2
Mol. Mass.549.666
SMILESCN(CCc1ccccn1)C(=O)c1cc2cccc(NC(=O)Nc3cc(nn3-c3ccc(C)cc3)C(C)(C)C)c2[nH]1