Reaction Details
TargetProtein-tyrosine kinase 2-beta
LigandBDBM50318872
Substrate/Competitorn/a
Meas. Tech.ChEMBL_885497 (CHEMBL2209549)
IC50 190±n/a nM
Citation Bhattacharya, SKAspnes, GEBagley, SWBoehm, MBrosius, ADBuckbinder, LChang, JSDibrino, JEng, HFrederick, KSGriffith, DAGriffor, MCGuimarães, CRGuzman-Perez, AHan, SKalgutkar, ASKlug-McLeod, JGarcia-Irizarry, CLi, JLippa, BPrice, DASouthers, JAWalker, DPWei, LXiao, JZawistoski, MPZhao, X Identification of novel series of pyrazole and indole-urea based DFG-out PYK2 inhibitors. Bioorg Med Chem Lett22:7523-9 (2012) 
 
Protein-tyrosine kinase 2-beta
Name:Protein-tyrosine kinase 2-beta
Type:PROTEIN
Mol. Mass.:115790.07
Organism:Mus musculus
Description:ChEMBL_885497
Residue:1009
BDBM50318872
NameBDBM50318872
Synonyms:1-(3-tert-butyl-1-p-tolyl-1H-pyrazol-5-yl)-3-(3-((pyridin-3-yloxy)methyl)-1H-pyrazol-5-yl)urea PF-4618433
TypeSmall organic molecule
Emp. Form.C24H27N7O2
Mol. Mass.445.5169
SMILESCc1ccc(cc1)-n1nc(cc1NC(=O)Nc1cc(COc2cccnc2)n[nH]1)C(C)(C)C