Reaction Details
TargetProtein-tyrosine kinase 2-beta
LigandBDBM50403007
Substrate/Competitorn/a
Meas. Tech.ChEMBL_885497 (CHEMBL2209549)
IC50 4700±n/a nM
Citation Bhattacharya, SKAspnes, GEBagley, SWBoehm, MBrosius, ADBuckbinder, LChang, JSDibrino, JEng, HFrederick, KSGriffith, DAGriffor, MCGuimarães, CRGuzman-Perez, AHan, SKalgutkar, ASKlug-McLeod, JGarcia-Irizarry, CLi, JLippa, BPrice, DASouthers, JAWalker, DPWei, LXiao, JZawistoski, MPZhao, X Identification of novel series of pyrazole and indole-urea based DFG-out PYK2 inhibitors. Bioorg Med Chem Lett22:7523-9 (2012) 
 
Protein-tyrosine kinase 2-beta
Name:Protein-tyrosine kinase 2-beta
Type:PROTEIN
Mol. Mass.:115790.07
Organism:Mus musculus
Description:ChEMBL_885497
Residue:1009
BDBM50403007
NameBDBM50403007
Synonyms:CHEMBL2207435
TypeSmall organic molecule
Emp. Form.C23H25N7O2
Mol. Mass.431.4903
SMILESCc1ccc(cc1)-n1nc(cc1NC(=O)Nc1cc(n[nH]1)-c1ccc(=O)[nH]c1)C(C)(C)C