Reaction Details
TargetSerine/threonine-protein kinase PLK1
LigandBDBM50403016
Substrate/Competitorn/a
Meas. Tech.ChEMBL_885647 (CHEMBL2211781)
IC50 5.6±n/a nM
Citation Qian, WJPark, JELee, KSBurke, TR Non-proteinogenic amino acids in the pThr-2 position of a pentamer peptide that confer high binding affinity for the polo box domain (PBD) of polo-like kinase 1 (Plk1). Bioorg Med Chem Lett22:7306-8 (2012) 
 
Serine/threonine-protein kinase PLK1
Name:Serine/threonine-protein kinase PLK1
Type:Serine/threonine-protein kinase
Mol. Mass.:68277.16
Organism:Homo sapiens (Human)
Description:P53350
Residue:603
BDBM50403016
NameBDBM50403016
Synonyms:CHEMBL2207845
TypeSmall organic molecule
Emp. Form.C40H63N8O11P
Mol. Mass.862.949
SMILESCC(C)C[C@H](NC(=O)[C@@H]1CCCN1C(C)=O)C(=O)N[C@@H](Cc1cncn1CCCCCCCCc1ccccc1)C(=O)N[C@@H](CO)C(=O)N[C@@H]([C@@H](C)OP(O)(O)=O)C(N)=O