Reaction Details
TargetNAD-dependent protein deacetylase sirtuin-2
LigandBDBM50403018
Substrate/Competitorn/a
Meas. Tech.ChEMBL_885678 (CHEMBL2211812)
IC50 4500000±n/a nM
Citation Amagata, TXiao, JChen, YPHolsopple, NOliver, AGGokey, TGuliaev, ABMinoura, K Creation of an HDAC-based yeast screening method for evaluation of marine-derived actinomycetes: discovery of streptosetin A. J Nat Prod75:2193-9 (2012) 
 
NAD-dependent protein deacetylase sirtuin-2
Name:NAD-dependent protein deacetylase sirtuin-2
Type:Hydrolase
Mol. Mass.:43172.62
Organism:Homo sapiens (Human)
Description:n/a
Residue:389
BDBM50403018
NameBDBM50403018
Synonyms:CHEMBL2207877
TypeSmall organic molecule
Emp. Form.C19H25NO5
Mol. Mass.347.4055
SMILESCC[C@@H]1CC(=O)[C@@H]2[C@@H](O)C(C)=CC[C@H]2[C@]1(C)C(=O)c1c(O)c[nH]c1O