Reaction Details
TargetNAD-dependent protein deacetylase sirtuin-1
LigandBDBM50156760
Substrate/Competitorn/a
Meas. Tech.ChEMBL_885679 (CHEMBL2211813)
Temperature298.15±n/a K
IC50 40100±n/a nM
Commentsextracted
Citation Amagata, TXiao, JChen, YPHolsopple, NOliver, AGGokey, TGuliaev, ABMinoura, K Creation of an HDAC-based yeast screening method for evaluation of marine-derived actinomycetes: discovery of streptosetin A. J Nat Prod75:2193-9 (2012) 
 
NAD-dependent protein deacetylase sirtuin-1
Name:NAD-dependent protein deacetylase sirtuin-1
Type:Developmental protein; hydrolase
Mol. Mass.:81626.66
Organism:Homo sapiens (Human)
Description:n/a
Residue:747
BDBM50156760
NameBDBM50156760
Synonyms:(E)-2-((2-hydroxynaphthalen-1-yl)methyleneamino)-N-(1-phenylethyl)benzamide 2-{[(1-(2-hydroxy-naphthalen-1-yl)meth-(E)-ylidene]amino}-N-(1-phenylethyl)-benzamide CHEMBL380797 | Sirtinol
TypeSmall organic molecule
Emp. Form.C26H22N2O2
Mol. Mass.394.4651
SMILESCC(NC(=O)c1ccccc1\N=C\c1c(O)ccc2ccccc12)c1ccccc1