Reaction Details
TargetNAD-dependent protein deacetylase sirtuin-1
LigandBDBM50403018
Substrate/Competitorn/a
Meas. Tech.ChEMBL_885679 (CHEMBL2211813)
Temperature298.15±n/a K
IC50 3700000±n/a nM
Commentsextracted
Citation Amagata, TXiao, JChen, YPHolsopple, NOliver, AGGokey, TGuliaev, ABMinoura, K Creation of an HDAC-based yeast screening method for evaluation of marine-derived actinomycetes: discovery of streptosetin A. J Nat Prod75:2193-9 (2012) 
 
NAD-dependent protein deacetylase sirtuin-1
Name:NAD-dependent protein deacetylase sirtuin-1
Type:Developmental protein; hydrolase
Mol. Mass.:81626.66
Organism:Homo sapiens (Human)
Description:n/a
Residue:747
BDBM50403018
NameBDBM50403018
Synonyms:CHEMBL2207877
TypeSmall organic molecule
Emp. Form.C19H25NO5
Mol. Mass.347.4055
SMILESCC[C@@H]1CC(=O)[C@@H]2[C@@H](O)C(C)=CC[C@H]2[C@]1(C)C(=O)c1c(O)c[nH]c1O