Reaction Details
TargetCarnitine O-palmitoyltransferase 1, muscle isoform
LigandBDBM50403029
Substrate/Competitorn/a
Meas. Tech.ChEMBL_887532 (CHEMBL2217141)
IC50 40±n/a nM
Citation Ceccarelli, SMChomienne, OGubler, MArduini, A Carnitine palmitoyltransferase (CPT) modulators: a medicinal chemistry perspective on 35 years of research. J Med Chem54:3109-52 (2011) 
 
Carnitine O-palmitoyltransferase 1, muscle isoform
Name:Carnitine O-palmitoyltransferase 1, muscle isoform
Type:PROTEIN
Mol. Mass.:88241.28
Organism:Rattus norvegicus
Description:ChEMBL_887447
Residue:772
BDBM50403029
NameBDBM50403029
Synonyms:CHEMBL2216792
TypeSmall organic molecule
Emp. Form.C36H53ClN7O19P3S
Mol. Mass.1048.281
SMILESCC(C)(COP(O)(=O)OP(O)(=O)OC[C@H]1O[C@H]([C@H](O)[C@@H]1OP(O)(O)=O)n1cnc2c(N)cnnc12)[C@@H](O)C(=O)NCCC(=O)NCCSC(=O)[C@@]1(CCCCCCOc2ccc(Cl)cc2)CO1