Reaction Details
TargetCarnitine O-palmitoyltransferase 1, liver isoform
LigandBDBM50403030
Substrate/Competitorn/a
Meas. Tech.ChEMBL_887374 (CHEMBL2216983)
IC50 250±n/a nM
Citation Ceccarelli, SMChomienne, OGubler, MArduini, A Carnitine palmitoyltransferase (CPT) modulators: a medicinal chemistry perspective on 35 years of research. J Med Chem54:3109-52 (2011) 
 
Carnitine O-palmitoyltransferase 1, liver isoform
Name:Carnitine O-palmitoyltransferase 1, liver isoform
Type:PROTEIN
Mol. Mass.:88389.31
Organism:Homo sapiens (Human)
Description:ChEMBL_887463
Residue:773
BDBM50403030
NameBDBM50403030
Synonyms:CHEMBL2216768
TypeSmall organic molecule
Emp. Form.C15H16ClF2O4
Mol. Mass.333.735
SMILES[O-]C(=O)C1(CO1)C(F)(F)CCCCCOc1ccc(Cl)cc1