Reaction Details
TargetCarnitine O-palmitoyltransferase 2, mitochondrial
LigandBDBM50118093
Substrate/Competitorn/a
Meas. Tech.ChEMBL_887441 (CHEMBL2217050)
IC50>100000±n/a nM
Citation Ceccarelli, SMChomienne, OGubler, MArduini, A Carnitine palmitoyltransferase (CPT) modulators: a medicinal chemistry perspective on 35 years of research. J Med Chem54:3109-52 (2011) 
 
Carnitine O-palmitoyltransferase 2, mitochondrial
Name:Carnitine O-palmitoyltransferase 2, mitochondrial
Type:PROTEIN
Mol. Mass.:74118.53
Organism:Rattus norvegicus
Description:ChEMBL_887443
Residue:658
BDBM50118093
NameBDBM50118093
Synonyms:(4-Hydroxy-phenyl)-oxo-acetic acid | CHEMBL129918
TypeSmall organic molecule
Emp. Form.C8H6O4
Mol. Mass.166.1308
SMILESOC(=O)C(=O)c1ccc(O)cc1