Reaction Details
TargetCarnitine O-palmitoyltransferase 1, liver isoform
LigandBDBM50118093
Substrate/Competitorn/a
Meas. Tech.ChEMBL_887463 (CHEMBL2217072)
IC50>100000±n/a nM
Citation Ceccarelli, SMChomienne, OGubler, MArduini, A Carnitine palmitoyltransferase (CPT) modulators: a medicinal chemistry perspective on 35 years of research. J Med Chem54:3109-52 (2011) 
 
Carnitine O-palmitoyltransferase 1, liver isoform
Name:Carnitine O-palmitoyltransferase 1, liver isoform
Type:PROTEIN
Mol. Mass.:88389.31
Organism:Homo sapiens (Human)
Description:ChEMBL_887463
Residue:773
BDBM50118093
NameBDBM50118093
Synonyms:(4-Hydroxy-phenyl)-oxo-acetic acid | CHEMBL129918
TypeSmall organic molecule
Emp. Form.C8H6O4
Mol. Mass.166.1308
SMILESOC(=O)C(=O)c1ccc(O)cc1