Reaction Details
TargetCarnitine O-palmitoyltransferase 1, liver isoform
LigandBDBM50403032
Substrate/Competitorn/a
Meas. Tech.ChEMBL_887463 (CHEMBL2217072)
IC50 1700±n/a nM
Citation Ceccarelli, SMChomienne, OGubler, MArduini, A Carnitine palmitoyltransferase (CPT) modulators: a medicinal chemistry perspective on 35 years of research. J Med Chem54:3109-52 (2011) 
 
Carnitine O-palmitoyltransferase 1, liver isoform
Name:Carnitine O-palmitoyltransferase 1, liver isoform
Type:PROTEIN
Mol. Mass.:88389.31
Organism:Homo sapiens (Human)
Description:ChEMBL_887463
Residue:773
BDBM50403032
NameBDBM50403032
Synonyms:CHEMBL2216785
TypeSmall organic molecule
Emp. Form.C24H41N3O5
Mol. Mass.451.5994
SMILESCCCCCCOc1cccc(OCCCCNC(=O)N[C@H](CC([O-])=O)C[N+](C)(C)C)c1