Reaction Details
TargetCarnitine O-palmitoyltransferase 1, muscle isoform
LigandBDBM50403033
Substrate/Competitorn/a
Meas. Tech.ChEMBL_887462 (CHEMBL2217071)
IC50 21700±n/a nM
Citation Ceccarelli, SMChomienne, OGubler, MArduini, A Carnitine palmitoyltransferase (CPT) modulators: a medicinal chemistry perspective on 35 years of research. J Med Chem54:3109-52 (2011) 
 
Carnitine O-palmitoyltransferase 1, muscle isoform
Name:Carnitine O-palmitoyltransferase 1, muscle isoform
Type:PROTEIN
Mol. Mass.:87823.36
Organism:Homo sapiens (Human)
Description:ChEMBL_887440
Residue:772
BDBM50403033
NameBDBM50403033
Synonyms:CHEMBL1231507
TypeSmall organic molecule
Emp. Form.C23H46N2O3
Mol. Mass.398.6229
(=O)N[C@H](CC([O-])=O)C[N+](C)(C)C