Reaction Details
TargetCarnitine O-palmitoyltransferase 2, mitochondrial
LigandBDBM50403034
Substrate/Competitorn/a
Meas. Tech.ChEMBL_887441 (CHEMBL2217050)
IC50 5100±n/a nM
Citation Ceccarelli, SMChomienne, OGubler, MArduini, A Carnitine palmitoyltransferase (CPT) modulators: a medicinal chemistry perspective on 35 years of research. J Med Chem54:3109-52 (2011) 
 
Carnitine O-palmitoyltransferase 2, mitochondrial
Name:Carnitine O-palmitoyltransferase 2, mitochondrial
Type:PROTEIN
Mol. Mass.:74118.53
Organism:Rattus norvegicus
Description:ChEMBL_887443
Residue:658
BDBM50403034
NameBDBM50403034
Synonyms:CHEMBL2114397
TypeSmall organic molecule
Emp. Form.C7H16N2O2
Mol. Mass.160.2141
SMILESC[N+](C)(C)C[C@H](N)CC([O-])=O