Reaction Details
TargetCarnitine O-palmitoyltransferase 1, liver isoform
LigandBDBM61402
Substrate/Competitorn/a
Meas. Tech.ChEMBL_887463 (CHEMBL2217072)
IC50>100000±n/a nM
Citation Ceccarelli, SMChomienne, OGubler, MArduini, A Carnitine palmitoyltransferase (CPT) modulators: a medicinal chemistry perspective on 35 years of research. J Med Chem54:3109-52 (2011) 
 
Carnitine O-palmitoyltransferase 1, liver isoform
Name:Carnitine O-palmitoyltransferase 1, liver isoform
Type:PROTEIN
Mol. Mass.:88389.31
Organism:Homo sapiens (Human)
Description:ChEMBL_887463
Residue:773
BDBM61402
NameBDBM61402
Synonyms:(Z)-2-butenedioic acid;2-(2,2-dicyclohexylethyl)piperidine 2-(2,2-dicyclohexylethyl)piperidine;maleic acid CHEMBL75880 Perhexiline cid_5284439 | perhexiline maleate
TypeSmall organic molecule
Emp. Form.C19H35N
Mol. Mass.277.4879
SMILESC(C(C1CCCCC1)C1CCCCC1)C1CCCCN1