Reaction Details
TargetCarnitine O-palmitoyltransferase 2, mitochondrial
LigandBDBM50403043
Substrate/Competitorn/a
Meas. Tech.ChEMBL_887441 (CHEMBL2217050)
IC50 28500±n/a nM
Citation Ceccarelli, SMChomienne, OGubler, MArduini, A Carnitine palmitoyltransferase (CPT) modulators: a medicinal chemistry perspective on 35 years of research. J Med Chem54:3109-52 (2011) 
 
Carnitine O-palmitoyltransferase 2, mitochondrial
Name:Carnitine O-palmitoyltransferase 2, mitochondrial
Type:PROTEIN
Mol. Mass.:74118.53
Organism:Rattus norvegicus
Description:ChEMBL_887443
Residue:658
BDBM50403043
NameBDBM50403043
Synonyms:CHEMBL2216780
TypeSmall organic molecule
Emp. Form.C20H14Cl2N2O5S
Mol. Mass.465.307
SMILESOC(=O)c1ccc(NC(=O)c2cccc(NS(=O)(=O)c3ccc(Cl)c(Cl)c3)c2)cc1