Reaction Details
TargetCarnitine O-palmitoyltransferase 1, muscle isoform
LigandBDBM50118093
Substrate/Competitorn/a
Meas. Tech.ChEMBL_887440 (CHEMBL2217049)
IC50 11000±n/a nM
Citation Ceccarelli, SMChomienne, OGubler, MArduini, A Carnitine palmitoyltransferase (CPT) modulators: a medicinal chemistry perspective on 35 years of research. J Med Chem54:3109-52 (2011) 
 
Carnitine O-palmitoyltransferase 1, muscle isoform
Name:Carnitine O-palmitoyltransferase 1, muscle isoform
Type:PROTEIN
Mol. Mass.:87823.36
Organism:Homo sapiens (Human)
Description:ChEMBL_887440
Residue:772
BDBM50118093
NameBDBM50118093
Synonyms:(4-Hydroxy-phenyl)-oxo-acetic acid | CHEMBL129918
TypeSmall organic molecule
Emp. Form.C8H6O4
Mol. Mass.166.1308
SMILESOC(=O)C(=O)c1ccc(O)cc1