Reaction Details
TargetCarnitine O-palmitoyltransferase 1, liver isoform
LigandBDBM50403045
Substrate/Competitorn/a
Meas. Tech.ChEMBL_887446 (CHEMBL2217055)
IC50 51000000±n/a nM
Citation Ceccarelli, SMChomienne, OGubler, MArduini, A Carnitine palmitoyltransferase (CPT) modulators: a medicinal chemistry perspective on 35 years of research. J Med Chem54:3109-52 (2011) 
 
Carnitine O-palmitoyltransferase 1, liver isoform
Name:Carnitine O-palmitoyltransferase 1, liver isoform
Type:PROTEIN
Mol. Mass.:88389.31
Organism:Homo sapiens (Human)
Description:ChEMBL_887463
Residue:773
BDBM50403045
NameBDBM50403045
Synonyms:CHEMBL2216773
TypeSmall organic molecule
Emp. Form.C31H48N2O4S
Mol. Mass.544.789
SMILESCOc1ccc(CN2CCN(CCCSc3cc(c(O)c(c3)C(C)(C)C)C(C)(C)C)CC2)c(OC)c1OC