Reaction Details
TargetCarnitine O-palmitoyltransferase 1, liver isoform
LigandBDBM50403046
Substrate/Competitorn/a
Meas. Tech.ChEMBL_887442 (CHEMBL2217051)
IC50>10000±n/a nM
Citation Ceccarelli, SMChomienne, OGubler, MArduini, A Carnitine palmitoyltransferase (CPT) modulators: a medicinal chemistry perspective on 35 years of research. J Med Chem54:3109-52 (2011) 
 
Carnitine O-palmitoyltransferase 1, liver isoform
Name:Carnitine O-palmitoyltransferase 1, liver isoform
Type:PROTEIN
Mol. Mass.:88147.11
Organism:Rattus norvegicus
Description:ChEMBL_887445
Residue:773
BDBM50403046
NameBDBM50403046
Synonyms:CHEMBL2216772
TypeSmall organic molecule
Emp. Form.C32H52N2O2
Mol. Mass.496.7675
SMILESCCCCc1ccc(NC(=O)OCCN2CCCCC2CC(C2CCCCC2)C2CCCCC2)cc1