Reaction Details
TargetRibosyldihydronicotinamide dehydrogenase [quinone]
LigandBDBM13530
Substrate/Competitorn/a
Meas. Tech.ChEMBL_887590 (CHEMBL2217199)
IC50 400±n/a nM
Citation Michaelis, SMarais, ASchrey, AKGraebner, OYSchaudt, CSefkow, MKroll, FDreger, MGlinski, MKoester, HMetternich, RFischer, JJ Dabigatran and dabigatran ethyl ester: potent inhibitors of ribosyldihydronicotinamide dehydrogenase (NQO2). J Med Chem55:3934-44 (2012) 
 
Ribosyldihydronicotinamide dehydrogenase [quinone]
Name:Ribosyldihydronicotinamide dehydrogenase [quinone]
Type:Protein
Mol. Mass.:25917.25
Organism:Homo sapiens (Human)
Description:P16083
Residue:231
BDBM13530
NameBDBM13530
Synonyms:4-[(4-methylpiperazin-1-yl)methyl]-N-[4-methyl-3-[(4-pyridin-3-ylpyrimidin-2-yl)amino]phenyl]benzamide Gleevec Imatinib, 21 STI-571 US10906896, Cpd imatinib US11725005, Compound imatinib cid_5291 med.21724, Compound 6
TypeSmall organic molecule
Emp. Form.C29H31N7O
Mol. Mass.493.6027
SMILESCN1CCN(Cc2ccc(cc2)C(=O)Nc2ccc(C)c(Nc3nccc(n3)-c3cccnc3)c2)CC1