Reaction Details
TargetRAC-alpha serine/threonine-protein kinase
LigandBDBM50403054
Substrate/Competitorn/a
Meas. Tech.ChEMBL_887645 (CHEMBL2217254)
IC50 149±n/a nM
Citation Barf, TKaptein, A Irreversible protein kinase inhibitors: balancing the benefits and risks. J Med Chem55:6243-62 (2012) 
 
RAC-alpha serine/threonine-protein kinase
Name:RAC-alpha serine/threonine-protein kinase
Type:Enzyme
Mol. Mass.:55681.25
Organism:Homo sapiens (Human)
Description:P31749
Residue:480
BDBM50403054
NameBDBM50403054
Synonyms:CHEMBL2216825
TypeSmall organic molecule
Emp. Form.C24H27NO8
Mol. Mass.457.4731
SMILESC[C@H]1O[C@H](C[C@H]([C@@H]1O)N(C)C)c1ccc2C(=O)C3=C([C@@H](C)O[C@@H]4CC(=O)O[C@H]34)C(=O)c2c1O