Reaction Details
TargetEpidermal growth factor receptor
LigandBDBM4566
Substrate/Competitorn/a
Meas. Tech.ChEMBL_887628 (CHEMBL2217237)
IC50 0.37±n/a nM
Citation Barf, TKaptein, A Irreversible protein kinase inhibitors: balancing the benefits and risks. J Med Chem55:6243-62 (2012) 
 
Epidermal growth factor receptor
Name:Epidermal growth factor receptor
Type:Receptor Kinase Domain
Mol. Mass.:134279.59
Organism:Homo sapiens (Human)
Description:P00533
Residue:1210
BDBM4566
NameBDBM4566
Synonyms:4-anilinoquinazoline deriv. 1 N-{4-[(3-bromophenyl)amino]quinazolin-6-yl}but-2-ynamide
TypeSmall organic molecule
Emp. Form.C18H13BrN4O
Mol. Mass.381.226
SMILESCC#CC(=O)Nc1ccc2ncnc(Nc3cccc(Br)c3)c2c1