Reaction Details
TargetFibroblast growth factor receptor 3
LigandBDBM50403060
Substrate/Competitorn/a
Meas. Tech.ChEMBL_887624 (CHEMBL2217233)
IC50 12±n/a nM
Citation Barf, TKaptein, A Irreversible protein kinase inhibitors: balancing the benefits and risks. J Med Chem55:6243-62 (2012) 
 
Fibroblast growth factor receptor 3
Name:Fibroblast growth factor receptor 3
Type:Protein
Mol. Mass.:87699.57
Organism:Homo sapiens (Human)
Description:P22607
Residue:806
BDBM50403060
NameBDBM50403060
Synonyms:CHEMBL2216830
TypeSmall organic molecule
Emp. Form.C32H39Cl2N7O4
Mol. Mass.656.603
SMILESCCN(CC)CCCCNc1ncc2CN(C(=O)N(Cc3cccc(NC(=O)C=C)c3)c2n1)c1c(Cl)c(OC)cc(OC)c1Cl