Reaction Details
TargetFibroblast growth factor receptor 2
LigandBDBM50403060
Substrate/Competitorn/a
Meas. Tech.ChEMBL_887623 (CHEMBL2217232)
IC50 6.2±n/a nM
Citation Barf, TKaptein, A Irreversible protein kinase inhibitors: balancing the benefits and risks. J Med Chem55:6243-62 (2012) 
 
Fibroblast growth factor receptor 2
Name:Fibroblast growth factor receptor 2
Type:Enzyme
Mol. Mass.:92015.45
Organism:Homo sapiens (Human)
Description:P21802
Residue:821
BDBM50403060
NameBDBM50403060
Synonyms:CHEMBL2216830
TypeSmall organic molecule
Emp. Form.C32H39Cl2N7O4
Mol. Mass.656.603
SMILESCCN(CC)CCCCNc1ncc2CN(C(=O)N(Cc3cccc(NC(=O)C=C)c3)c2n1)c1c(Cl)c(OC)cc(OC)c1Cl