Reaction Details
TargetPhosphatidylinositol 4,5-bisphosphate 3-kinase catalytic subunit delta isoform
LigandBDBM50403070
Substrate/Competitorn/a
Meas. Tech.ChEMBL_887705 (CHEMBL2217314)
IC50 2±n/a nM
Citation Cushing, TDMetz, DPWhittington, DAMcGee, LR PI3Kd and PI3K¿ as targets for autoimmune and inflammatory diseases. J Med Chem55:8559-81 (2012) 
 
Phosphatidylinositol 4,5-bisphosphate 3-kinase catalytic subunit delta isoform
Name:Phosphatidylinositol 4,5-bisphosphate 3-kinase catalytic subunit delta isoform
Type:Enzyme Subunit
Mol. Mass.:119489.41
Organism:Homo sapiens (Human)
Description:O00329
Residue:1044
BDBM50403070
NameBDBM50403070
Synonyms:CHEMBL2216888
TypeSmall organic molecule
Emp. Form.C22H15ClN8
Mol. Mass.426.861
SMILESCc1cccc2nc(c(Cn3nc(C#N)c4c(N)ncnc34)nc12)-c1ccccc1Cl