Reaction Details
TargetPhosphatidylinositol 4,5-bisphosphate 3-kinase catalytic subunit delta isoform
LigandBDBM50390425
Substrate/Competitorn/a
Meas. Tech.ChEMBL_887653 (CHEMBL2217262)
IC50 16±n/a nM
Citation Cushing, TDMetz, DPWhittington, DAMcGee, LR PI3Kd and PI3K¿ as targets for autoimmune and inflammatory diseases. J Med Chem55:8559-81 (2012) 
 
Phosphatidylinositol 4,5-bisphosphate 3-kinase catalytic subunit delta isoform
Name:Phosphatidylinositol 4,5-bisphosphate 3-kinase catalytic subunit delta isoform
Type:Enzyme Subunit
Mol. Mass.:119489.41
Organism:Homo sapiens (Human)
Description:O00329
Residue:1044
BDBM50390425
NameBDBM50390425
Synonyms:CHEMBL2071341
TypeSmall organic molecule
Emp. Form.C19H24FN3O5S2
Mol. Mass.457.539
SMILESCc1nc(NC(=O)NCCC(=O)OC(C)(C)C)sc1-c1ccc(c(F)c1)S(C)(=O)=O