Reaction Details
TargetPhosphatidylinositol 4,5-bisphosphate 3-kinase catalytic subunit delta isoform
LigandBDBM50403085
Substrate/Competitorn/a
Meas. Tech.ChEMBL_887653 (CHEMBL2217262)
Ki 3±n/a nM
Citation Cushing, TDMetz, DPWhittington, DAMcGee, LR PI3Kd and PI3K¿ as targets for autoimmune and inflammatory diseases. J Med Chem55:8559-81 (2012) 
 
Phosphatidylinositol 4,5-bisphosphate 3-kinase catalytic subunit delta isoform
Name:Phosphatidylinositol 4,5-bisphosphate 3-kinase catalytic subunit delta isoform
Type:Enzyme Subunit
Mol. Mass.:119489.41
Organism:Homo sapiens (Human)
Description:O00329
Residue:1044
BDBM50403085
NameBDBM50403085
Synonyms:CHEMBL2216848
TypeSmall organic molecule
Emp. Form.C18H22ClN5O4S
Mol. Mass.439.916
SMILESCCOC(=O)CCNC(=O)Nc1nc2CCN(Cc2s1)c1cnc(Cl)c(OC)c1