Reaction Details
TargetPhosphatidylinositol 4,5-bisphosphate 3-kinase catalytic subunit delta isoform
LigandBDBM50392138
Substrate/Competitorn/a
Meas. Tech.ChEMBL_887653 (CHEMBL2217262)
IC50 3.4±n/a nM
Citation Cushing, TDMetz, DPWhittington, DAMcGee, LR PI3Kd and PI3K¿ as targets for autoimmune and inflammatory diseases. J Med Chem55:8559-81 (2012) 
 
Phosphatidylinositol 4,5-bisphosphate 3-kinase catalytic subunit delta isoform
Name:Phosphatidylinositol 4,5-bisphosphate 3-kinase catalytic subunit delta isoform
Type:Enzyme Subunit
Mol. Mass.:119489.41
Organism:Homo sapiens (Human)
Description:O00329
Residue:1044
BDBM50392138
NameBDBM50392138
Synonyms:CHEMBL2152768
TypeSmall organic molecule
Emp. Form.C28H33FN6O2
Mol. Mass.504.599
SMILESCC(C)(O)C1CCN(Cc2ccc3nc(nc(N4CCOCC4)c3n2)-c2c(F)ccc3[nH]ccc23)CC1