Reaction Details
Target3-oxo-5-alpha-steroid 4-dehydrogenase 1
LigandBDBM50032762
Substrate/Competitorn/a
Meas. Tech.ChEBML_204899
IC50 7.9±n/a nM
Citation Wikel, JHBemis, KGAudia, JEMcQuaid, LAJones, CDPennington, PALawhorn, DEHirsch, KRStamm, NB QSAR study of benzoquinolinones as inhibitors of human type 1 5--reductase. Bioorg Med Chem Lett3:1157-1162 (1993)    Article
 
3-oxo-5-alpha-steroid 4-dehydrogenase 1
Name:3-oxo-5-alpha-steroid 4-dehydrogenase 1
Type:Enzyme
Mol. Mass.:29472.80
Organism:Homo sapiens (Human)
Description:P18405
Residue:259
BDBM50032762
NameBDBM50032762
Synonyms:(4aR,10bR)-8-Chloro-4-methyl-1,4,4a,5,6,10b-hexahydro-2H-benzo[f]quinolin-3-one 4,8-Dimethyl-4a,5,6,10b-tetrahydro-4H-benzo[f]quinolin-3-one Bexlosteride LY-191704
TypeSmall organic molecule
Emp. Form.C14H16ClNO
Mol. Mass.249.736
SMILESCN1C2CCc3cc(Cl)ccc3[C@H]2CCC1=O