Reaction Details
TargetAngiotensin-converting enzyme
LigandBDBM50403250
Substrate/Competitorn/a
Meas. Tech.ChEMBL_35584 (CHEMBL648282)
IC50 17±n/a nM
Citation Robl, JASimpkins, LMStevenson, JSun, CMurugesan, NBarrish, JCAsaad, MMBird, JSchaeffer, TRTrippodo, NCPetrillo, EWKaranewsky, DS Dual metalloprotease inhibitors. I. constrained peptidomimetics of mercaptoacyl dipeptides Bioorg Med Chem Lett4:1789-1794 (1994)    Article
 
Angiotensin-converting enzyme
Name:Angiotensin-converting enzyme
Type:Enzyme
Mol. Mass.:149709.01
Organism:Homo sapiens (Human)
Description:n/a
Residue:1306
BDBM50403250
NameBDBM50403250
Synonyms:CHEMBL51780
TypeSmall organic molecule
Emp. Form.C21H22N2O4S2
Mol. Mass.430.54
SMILESOC(=O)CN1c2ccccc2SC[C@H](NC(=O)[C@@H](CS)Cc2ccccc2)C1=O