Reaction Details
TargetNeprilysin
LigandBDBM50403253
Substrate/Competitorn/a
Meas. Tech.ChEMBL_144627 (CHEMBL883549)
IC50 1.2±n/a nM
Citation Robl, JASimpkins, LMStevenson, JSun, CMurugesan, NBarrish, JCAsaad, MMBird, JSchaeffer, TRTrippodo, NCPetrillo, EWKaranewsky, DS Dual metalloprotease inhibitors. I. constrained peptidomimetics of mercaptoacyl dipeptides Bioorg Med Chem Lett4:1789-1794 (1994)    Article
 
Neprilysin
Name:Neprilysin
Type:Enzyme
Mol. Mass.:85505.38
Organism:Homo sapiens (Human)
Description:P08473
Residue:750
BDBM50403253
NameBDBM50403253
Synonyms:CHEMBL301751
TypeSmall organic molecule
Emp. Form.C21H22N2O5S
Mol. Mass.414.475
SMILESOC(=O)CCN1c2ccccc2OC[C@H](NC(=O)[C@@H](S)Cc2ccccc2)C1=O